Target
Vasopressin V2 receptor
Ligand
BDBM50407339
Substrate
Meas. Tech.
ChEMBL_215023 (CHEMBL856234)
Kd
3162.28±n/a nM
Citation
 Manning, MCheng, LLKlis, WABalaspiri, LOlma, ASawyer, WHWo, NCChan, WY Effects of a D-Cys6/L-Cys6 interchange in nonselective and selective vasopressin and oxytocin antagonists. J Med Chem 38:1762-9 (1995)  
Target
Name:
Vasopressin V2 receptor
Synonyms:
AVPR V2 Avpr2 V2R_RAT Vasopressin receptor
Type:
G-protein coupled receptor
Mol. Mass.:
40761.85
Organism:
Rattus norvegicus (Rat)
Description:
Residue:
371
  
Inhibitor
Name:
BDBM50407339
Synonyms:
CHEMBL1790307
Type:
Small organic molecule
Emp. Form.:
C46H68N10O11S2
Mol. Mass.:
1001.223
SMILES:
CC[C@H](C)[C@H]1NC(=O)[C@H](Cc2cc3ccccc3[nH]2)NC(=O)CC2(CCCCC2)SSC[C@@H](NC(=O)[C@@H](CC(N)=O)NC(=O)[C@@H](NC1=O)[C@@H](C)O)C(=O)N1CCC[C@H]1C(=O)N[C@@H](CCCN)C(O)=O
: