Target
Gastrin/cholecystokinin type B receptor
Ligand
BDBM85153
Substrate
Meas. Tech.
ChEMBL_48120 (CHEMBL661439)
IC50
17378±n/a nM
Citation
 Henke, BRWillson, TMSugg, EECroom, DKDougherty, RWQueen, KLBirkemo, LSErvin, GNGrizzle, MKJohnson, MFJames, MK 3-(1H-indazol-3-ylmethyl)-1,5-benzodiazepines: CCK-A agonists that demonstrate oral activity as satiety agents. J Med Chem 39:2655-8 (1996)  
Target
Name:
Gastrin/cholecystokinin type B receptor
Synonyms:
CCK-2 receptor CCK-BR CCKRB Cholecystokinin receptor GASR_HUMAN | Gastrin/cholecystokinin type B receptor
Type:
G Protein-Coupled Receptor (GPCR)
Mol. Mass.:
48445.79
Organism:
Homo sapiens (Human)
Description:
Stable expression of human CCK-2 receptors in HEK 293 cells.
Residue:
447
  
Inhibitor
Name:
BDBM85153
Synonyms:
CCK-A Agonist 20
Type:
Small organic molecule
Emp. Form.:
C37H36N4O4
Mol. Mass.:
600.7061
SMILES:
COc1ccc(cc1)N(C(C)C)C(=O)CN1c2ccccc2N(c2ccccc2)C(=O)C(C)(Cc2c[nH]c3ccccc23)C1=O
: