Target
5-hydroxytryptamine receptor 1A
Ligand
BDBM50407769
Substrate
Meas. Tech.
ChEMBL_559 (CHEMBL615579)
IC50
58.88±n/a nM
Citation
 Prunier, HRault, SLancelot, JCRobba, MRenard, PDelagrange, PPfeiffer, BCaignard, DHMisslin, RGuardiola-Lemaitre, BHamon, M Novel and selective partial agonists of 5-HT3 receptors. 2. Synthesis and biological evaluation of piperazinopyridopyrrolopyrazines, piperazinopyrroloquinoxalines, and piperazinopyridopyrroloquinoxalines. J Med Chem 40:1808-19 (1997)  
Target
Name:
5-hydroxytryptamine receptor 1A
Synonyms:
5-HT-1A 5-hydroxytryptamine receptor 1A (5-HT-1A) ADRB2RL1 Dopamine D2 receptor and serotonin 1a receptor HTR1A | Serotonin receptor 1A
Type:
Mol. Mass.:
46122.49
Organism:
Homo sapiens (Human)
Description:
Residue:
422
  
Inhibitor
Name:
BDBM50407769
Synonyms:
CHEMBL301765
Type:
Small organic molecule
Emp. Form.:
C13H14N4S
Mol. Mass.:
258.342
SMILES:
C1CN(CCN1)c1nc2ccsc2n2cccc12
: