Target
5-hydroxytryptamine receptor 1B
Ligand
BDBM50408169
Substrate
Meas. Tech.
ChEMBL_1399 (CHEMBL616188)
IC50
>100000±n/a nM
Citation
 Prunier, HRault, SLancelot, JCRobba, MRenard, PDelagrange, PPfeiffer, BCaignard, DHMisslin, RGuardiola-Lemaitre, BHamon, M Novel and selective partial agonists of 5-HT3 receptors. 2. Synthesis and biological evaluation of piperazinopyridopyrrolopyrazines, piperazinopyrroloquinoxalines, and piperazinopyridopyrroloquinoxalines. J Med Chem 40:1808-19 (1997)  
Target
Name:
5-hydroxytryptamine receptor 1B
Synonyms:
5-HT-1B 5-hydroxytryptamine receptor 1B (5HT1B) 5ht1b Serotonin 1 (5-HT1) receptor Serotonin receptor 1B
Type:
Protein
Mol. Mass.:
43173.33
Organism:
Rattus norvegicus (Rat)
Description:
P28564
Residue:
386
  
Inhibitor
Name:
BDBM50408169
Synonyms:
CHEMBL53195
Type:
Small organic molecule
Emp. Form.:
C32H35N7
Mol. Mass.:
517.6672
SMILES:
C(N1CCN(CC1)c1ccc2nc(N3CCN(Cc4ccccc4)CC3)c3cccn3c2n1)c1ccccc1
: