Target
5-hydroxytryptamine receptor 1A
Ligand
BDBM50408175
Substrate
Meas. Tech.
ChEMBL_559 (CHEMBL615579)
IC50
40738.03±n/a nM
Citation
 Prunier, HRault, SLancelot, JCRobba, MRenard, PDelagrange, PPfeiffer, BCaignard, DHMisslin, RGuardiola-Lemaitre, BHamon, M Novel and selective partial agonists of 5-HT3 receptors. 2. Synthesis and biological evaluation of piperazinopyridopyrrolopyrazines, piperazinopyrroloquinoxalines, and piperazinopyridopyrroloquinoxalines. J Med Chem 40:1808-19 (1997)  
Target
Name:
5-hydroxytryptamine receptor 1A
Synonyms:
5-HT-1A 5-hydroxytryptamine receptor 1A (5-HT-1A) ADRB2RL1 Dopamine D2 receptor and serotonin 1a receptor HTR1A | Serotonin receptor 1A
Type:
Mol. Mass.:
46122.49
Organism:
Homo sapiens (Human)
Description:
Residue:
422
  
Inhibitor
Name:
BDBM50408175
Synonyms:
CHEMBL410531
Type:
Small organic molecule
Emp. Form.:
C22H20ClFN4
Mol. Mass.:
394.872
SMILES:
Fc1ccc(CN2CCN(CC2)c2nc3cc(Cl)ccc3n3cccc23)cc1
: