Target
Alpha-2B adrenergic receptor
Ligand
BDBM50408199
Substrate
Meas. Tech.
ChEMBL_33508 (CHEMBL647005)
Ki
8600±n/a nM
Citation
 Elworthy, TRFord, APBantle, GWMorgans, DJOzer, RSPalmer, WSRepke, DBRomero, MSandoval, LSjogren, EBTalamás, FXVazquez, AWu, HArredondo, NFBlue, DRDeSousa, AGross, LMKava, MSLesnick, JDVimont, RLWilliams, TJZhu, QMPfister, JRClarke, DE N-arylpiperazinyl-N'-propylamino derivatives of heteroaryl amides as functional uroselective alpha 1-adrenoceptor antagonists. J Med Chem 40:2674-87 (1997)  
Target
Name:
Alpha-2B adrenergic receptor
Synonyms:
ADA2B_RAT Adrenergic receptor alpha Alpha-2B adrenergic receptor Alpha-2B adrenoreceptor | adrenergic Alpha2B
Type:
Enzyme Catalytic Domain
Mol. Mass.:
50379.83
Organism:
NEONATAL RAT
Description:
adrenergic Alpha2B ADRA2B NEONATAL RAT::P19328
Residue:
453
  
Inhibitor
Name:
BDBM50408199
Synonyms:
CHEMBL88160
Type:
Small organic molecule
Emp. Form.:
C26H34F3N7O2
Mol. Mass.:
533.5891
SMILES:
CN(C)C(=O)c1cnc2n(C)nc(C)c2c1NCCCN1CCN(CC1)c1ccccc1OCC(F)(F)F
: