Target
Dopamine beta-hydroxylase
Ligand
BDBM50406074
Substrate
Meas. Tech.
ChEMBL_59428 (CHEMBL671831)
IC50
74131.02±n/a nM
Citation
 So, SSKarplus, M Three-dimensional quantitative structure-activity relationships from molecular similarity matrices and genetic neural networks. 2. Applications. J Med Chem 40:4360-71 (1998)  
Target
Name:
Dopamine beta-hydroxylase
Synonyms:
DBH Dopamine beta-monooxygenase | Soluble dopamine beta-hydroxylase
Type:
PROTEIN
Mol. Mass.:
69062.68
Organism:
Homo sapiens (Human)
Description:
ChEMBL_59428
Residue:
617
  
Inhibitor
Name:
BDBM50406074
Synonyms:
CHEMBL302341
Type:
Small organic molecule
Emp. Form.:
C11H11FN2OS
Mol. Mass.:
238.281
SMILES:
COc1ccc(Cn2cc[nH]c2=S)cc1F
: