Target
Acetylcholinesterase
Ligand
BDBM50055204
Substrate
Meas. Tech.
ChEMBL_29849 (CHEMBL641238)
IC50
3111.72±n/a nM
Citation
 So, SSKarplus, M Three-dimensional quantitative structure-activity relationships from molecular similarity matrices and genetic neural networks. 2. Applications. J Med Chem 40:4360-71 (1998)  
Target
Name:
Acetylcholinesterase
Synonyms:
ACES_HUMAN Acetylcholinesterase (AChE) | Acetylcholinesterase (human AChE)
Type:
Enzyme
Mol. Mass.:
67792.70
Organism:
Homo sapiens (Human)
Description:
P22303
Residue:
614
  
Inhibitor
Name:
BDBM50055204
Synonyms:
(3-Hydroxy-4-methyl-phenyl)-trimethyl-ammonium | CHEMBL137560
Type:
Small organic molecule
Emp. Form.:
C10H16NO
Mol. Mass.:
166.2396
SMILES:
Cc1ccc(cc1O)[N+](C)(C)C
: