Target
Acetylcholinesterase
Ligand
BDBM50055207
Substrate
Meas. Tech.
ChEMBL_29849 (CHEMBL641238)
IC50
152.05±n/a nM
Citation
 So, SSKarplus, M Three-dimensional quantitative structure-activity relationships from molecular similarity matrices and genetic neural networks. 2. Applications. J Med Chem 40:4360-71 (1998)  
Target
Name:
Acetylcholinesterase
Synonyms:
ACES_HUMAN Acetylcholinesterase (AChE) | Acetylcholinesterase (human AChE)
Type:
Enzyme
Mol. Mass.:
67792.70
Organism:
Homo sapiens (Human)
Description:
P22303
Residue:
614
  
Inhibitor
Name:
BDBM50055207
Synonyms:
(S)-5-Butylcarbamoyloxy-1,3a,8-trimethyl-1,2,3,3a,8,8a-hexahydro-pyrrolo[2,3-b]indol-1-ium
Type:
Small organic molecule
Emp. Form.:
C18H28N3O2
Mol. Mass.:
318.4333
SMILES:
CCCCNC(=O)Oc1ccc2N(C)C3[N@H+](C)CC[C@@]3(C)c2c1
: