Target
Melatonin receptor type 1A
Ligand
BDBM50037242
Substrate
Meas. Tech.
ChEMBL_105108 (CHEMBL856174)
IC50
1.58±n/a nM
Citation
 Marot, CChavatte, PMorin-Allory, LViaud, MCGuillaumet, GRenard, PLesieur, DMichel, A Pharmacophoric search and 3D-QSAR comparative molecular field analysis studies on agonists of melatonin sheep receptors. J Med Chem 41:4453-65 (1998)  
Target
Name:
Melatonin receptor type 1A
Synonyms:
MTNR1A MTR1A_HUMAN Mel1a melatonin receptor Melatonin receptor Melatonin receptor type 1 (MT1) | Melatonin receptor type 1A
Type:
Enzyme
Mol. Mass.:
39392.94
Organism:
Homo sapiens (Human)
Description:
P48039
Residue:
350
  
Inhibitor
Name:
BDBM50037242
Synonyms:
CHEMBL323332 N-[2-(5-Methoxy-benzofuran-3-yl)-ethyl]-acetamide
Type:
Small organic molecule
Emp. Form.:
C13H15NO3
Mol. Mass.:
233.2631
SMILES:
COc1ccc2occ(CCNC(C)=O)c2c1
: