Target
Beta-2 adrenergic receptor
Ligand
BDBM50409476
Substrate
Meas. Tech.
ChEMBL_218263 (CHEMBL819428)
IC50
281.84±n/a nM
Citation
 Tanaka, NTamai, TMukaiyama, HHirabayashi, AMuranaka, HAkahane, SMiyata, HAkahane, M Discovery of novel N-phenylglycine derivatives as potent and selective beta(3)-adrenoceptor agonists for the treatment of frequent urination and urinary incontinence. J Med Chem 44:1436-45 (2001)  
Target
Name:
Beta-2 adrenergic receptor
Synonyms:
ADRB2_RAT Adrb2r | Adrenergic receptor beta
Type:
PROTEIN
Mol. Mass.:
46896.26
Organism:
Rattus norvegicus
Description:
ChEMBL_38603
Residue:
418
  
Inhibitor
Name:
BDBM50409476
Synonyms:
CHEMBL289670
Type:
Small organic molecule
Emp. Form.:
C21H26N2O6
Mol. Mass.:
402.4409
SMILES:
C[C@H](NCCc1ccc(cc1)N(CC(O)=O)CC(O)=O)[C@H](O)c1ccc(O)cc1
: