Target
Estrogen receptor
Ligand
BDBM50409905
Substrate
Meas. Tech.
ChEMBL_100271 (CHEMBL712013)
EC50
3000±n/a nM
Citation
 von Rauch, MSchlenk, MGust, R Effects of C2-alkylation, N-alkylation, and N,N'-dialkylation on the stability and estrogen receptor interaction of (4R,5S)/(4S,5R)-4,5-bis(4-hydroxyphenyl)-2-imidazolines. J Med Chem 47:915-27 (2004)  
Target
Name:
Estrogen receptor
Synonyms:
ER ESR ESR1_HUMAN Estrogen receptor Estrogen receptor (ER-alpha) Estrogen receptor alpha (ER) Nuclear receptor subfamily 3 group A member 1
Type:
Protein
Mol. Mass.:
66230.44
Organism:
Homo sapiens (Human)
Description:
P03372
Residue:
595
  
Inhibitor
Name:
BDBM50409905
Synonyms:
CHEMBL354219
Type:
Small organic molecule
Emp. Form.:
C15H14Cl2N2O3
Mol. Mass.:
341.189
SMILES:
N[C@@H]([C@@H](NC=O)c1ccc(O)cc1Cl)c1ccc(O)cc1Cl
: