Target
Fatty-acid amide hydrolase 1
Ligand
BDBM50409952
Substrate
Meas. Tech.
ChEMBL_305202 (CHEMBL832456)
IC50
37400±n/a nM
Citation
 Nakazono, MHasegawa, SYamamoto, TZaitsu, K Synthesis of 61-bis(1-adamantylcarbamoyl)-1,2-methano[60]fullerene and its antagonistic effect on haloperidol-induced catalepsy in mice. Bioorg Med Chem Lett 14:5619-21 (2004)  
Target
Name:
Fatty-acid amide hydrolase 1
Synonyms:
Anandamide amidohydrolase FAAH1_MOUSE Faah1 Fatty-acid amide hydrolase (FAAH) Oleamide hydrolase 1
Type:
Hydrolase; single-pass membrane protein; homodimer
Mol. Mass.:
63227.28
Organism:
Mus musculus (mouse)
Description:
Mouse brain membranes were used in the assay.
Residue:
579
  
Inhibitor
Name:
BDBM50409952
Synonyms:
CHEMBL365034
Type:
Small organic molecule
Emp. Form.:
C30H47NO
Mol. Mass.:
437.7003
SMILES:
NC(=O)CCC\C=C/C\C=C/C\C=C/C\C=C/CCCCCC12CC3CC(CC(C3)C1)C2
: