Target
cGMP-specific 3',5'-cyclic phosphodiesterase
Ligand
BDBM50027734
Substrate
Meas. Tech.
ChEMBL_456375 (CHEMBL906422)
IC50
0.331±n/a nM
Citation
 Yoo, JThai, KMKim, DKLee, JYPark, HJ 3D-QSAR studies on sildenafil analogues, selective phosphodiesterase 5 inhibitors. Bioorg Med Chem Lett 17:4271-4 (2007)  
Target
Name:
cGMP-specific 3',5'-cyclic phosphodiesterase
Synonyms:
3',5'-cyclic phosphodiesterase PDE5 PDE5A_HUMAN Phosphodiesterase 5 (PDE5) Phosphodiesterase 5A (PDE5A) cGMP-specific 3',5'-cyclic phosphodiesterase
Type:
Protein
Mol. Mass.:
99975.83
Organism:
Homo sapiens (Human)
Description:
O76074
Residue:
875
  
Inhibitor
Name:
BDBM50027734
Synonyms:
CHEMBL246136
Type:
Small organic molecule
Emp. Form.:
C24H31N5O6S
Mol. Mass.:
517.598
SMILES:
CCCc1nn(C)c2c1nc([nH]c2=O)-c1cc(ccc1OCC)S(=O)(=O)N1CCC(CC(O)=O)CC1
: