Target
Potassium voltage-gated channel subfamily H member 2
Ligand
BDBM22877
Substrate
Meas. Tech.
ChEMBL_556369 (CHEMBL954102)
IC50
436.52±n/a nM
Citation
 Jia, LSun, H Support vector machines classification of hERG liabilities based on atom types. Bioorg Med Chem 16:6252-60 (2008)  
Target
Name:
Potassium voltage-gated channel subfamily H member 2
Synonyms:
1,3-beta-glucan synthase component GLS2 ERG Eag-related protein 1 Ether-a-go-go-related gene (HERG) Ether-a-go-go-related gene potassium channel 1 Ether-a-go-go-related gene potassium channel 1 (hERG1) Ether-a-go-go-related protein 1 H-ERG KCNH2 Potassium voltage-gated channel subfamily H member 2 (hERG) Voltage-gated potassium channel subunit Kv11.1 hERG Potassium Channel 1 | putative potassium channel subunit
Type:
Multi-pass membrane protein
Mol. Mass.:
126672.65
Organism:
Homo sapiens (Human)
Description:
Q12809
Residue:
1159
  
Inhibitor
Name:
BDBM22877
Synonyms:
2-((1-(1-(4-fluorobenzyl)-1H-benzo[d]imidazol-2-yl)piperidin-4-yl)(methyl)amino)pyrimidin-4(3H)-one 2-({1-[3-(4-Fluoro-benzyl)-1H-benzoimidazol-2-yl]-piperidin-4-yl}-methyl-amino)-2,3-dihydro-1H-pyrimidin-4-one(Mizolastine) CHEMBL94454 Mizollen | Zolistan
Type:
Small organic molecule
Emp. Form.:
C24H25FN6O
Mol. Mass.:
432.4933
SMILES:
CN(C1CCN(CC1)c1nc2ccccc2n1Cc1ccc(F)cc1)c1nccc(=O)[nH]1
: