Target
5-hydroxytryptamine receptor 7
Ligand
BDBM50375924
Substrate
Meas. Tech.
ChEMBL_521562 (CHEMBL1000710)
IC50
16±n/a nM
Citation
 Jalali-Heravi, MAsadollahi-Baboli, M Quantitative structure-activity relationship study of serotonin (5-HT7) receptor inhibitors using modified ant colony algorithm and adaptive neuro-fuzzy interference system (ANFIS). Eur J Med Chem 44:1463-70 (2009)  
Target
Name:
5-hydroxytryptamine receptor 7
Synonyms:
5-HT-7 5-HT7 5-HT7S 5HT7 HTR7 | Serotonin receptor 7
Type:
G Protein-Coupled Receptor (GPCR)
Mol. Mass.:
53573.08
Organism:
Homo sapiens (Human)
Description:
P34969
Residue:
479
  
Inhibitor
Name:
BDBM50375924
Synonyms:
CHEMBL261742
Type:
Small organic molecule
Emp. Form.:
C32H36FN5O4
Mol. Mass.:
573.6577
SMILES:
CCOc1ccccc1N1CCN(CCCC(=O)NCc2nc3ccc(F)cc3c(=O)n2-c2cccc(OC)c2)CC1
: