Target
Aldehyde dehydrogenase, mitochondrial
Ligand
BDBM50058655
Substrate
Meas. Tech.
ChEMBL_592877 (CHEMBL1046622)
IC50
39810.72±n/a nM
Citation
 Kapanda, CNMuccioli, GGLabar, GPoupaert, JHLambert, DM Bis(dialkylaminethiocarbonyl)disulfides as potent and selective monoglyceride lipase inhibitors. J Med Chem 52:7310-4 (2009)  
Target
Name:
Aldehyde dehydrogenase, mitochondrial
Synonyms:
ALDH2_RAT Aldh2
Type:
PROTEIN
Mol. Mass.:
56489.77
Organism:
Rattus norvegicus
Description:
ChEMBL_592877
Residue:
519
  
Inhibitor
Name:
BDBM50058655
Synonyms:
1,1',1'',1'''-[disulfanediylbis(carbonothioylnitrilo)]tetraethane Antabuse (TN) DISULFIRAM N,N,N',N'-tetraethylthiuram disulfide US11753371, Compound II-2a-(Disulfiram) bis(diethylthiocarbamoyl) disulfide med.21724, Compound 151 tetraethylthiuram disulfide | tetraethylthiuram disulphide
Type:
Small organic molecule
Emp. Form.:
C10H20N2S4
Mol. Mass.:
296.539
SMILES:
CCN(CC)C(=S)SSC(=S)N(CC)CC
: