Target
Alpha-2B adrenergic receptor
Ligand
BDBM50415138
Substrate
Meas. Tech.
ChEMBL_595090 (CHEMBL1047076)
EC50
3162±n/a nM
Citation
 Cardinaletti, CMattioli, LGhelfi, FDel Bello, FGiannella, MBruzzone, AParis, HPerfumi, MPiergentili, AQuaglia, WPigini, M Might adrenergic alpha2C-agonists/alpha2A-antagonists become novel therapeutic tools for pain treatment with morphine? J Med Chem 52:7319-22 (2009)  
Target
Name:
Alpha-2B adrenergic receptor
Synonyms:
ADA2B_HUMAN ADRA2L1 Adrenergic alpha2B Adrenergic receptor alpha Alpha-2 adrenergic receptor subtype C2 Alpha-2B adrenoreceptor | Alpha-2BAR
Type:
Enzyme
Mol. Mass.:
49964.20
Organism:
Homo sapiens (Human)
Description:
P18089
Residue:
450
  
Inhibitor
Name:
BDBM50415138
Synonyms:
CHEMBL576078
Type:
Small organic molecule
Emp. Form.:
C14H20N2O
Mol. Mass.:
232.3214
SMILES:
CCCc1ccccc1C(C)OC1=NCCN1
: