Target
Adenosine receptor A1
Ligand
BDBM50415179
Substrate
Meas. Tech.
ChEMBL_601032 (CHEMBL1069169)
Ki
194.98±n/a nM
Citation
 Balo, MCBrea, JCaamaño, OFernández, FGarcía-Mera, XLópez, CLoza, MINieto, MIRodríguez-Borges, JE Synthesis and pharmacological evaluation of novel 1- and 8-substituted-3-furfuryl xanthines as adenosine receptor antagonists. Bioorg Med Chem 17:6755-60 (2009)  
Target
Name:
Adenosine receptor A1
Synonyms:
AA1R_RAT ADENOSINE A1 high Adenosine A1 receptor (A1) Adenosine receptors A1 | Adora1
Type:
Protein
Mol. Mass.:
36704.13
Organism:
Rattus norvegicus (rat)
Description:
Residue:
326
  
Inhibitor
Name:
BDBM50415179
Synonyms:
CHEMBL603861
Type:
Small organic molecule
Emp. Form.:
C21H20F2N4O4
Mol. Mass.:
430.4047
SMILES:
COCCn1c(=O)n(Cc2ccco2)c2nc(Cc3c(F)cccc3F)n(C)c2c1=O
: