Target
G-protein coupled bile acid receptor 1
Ligand
BDBM50415427
Substrate
Meas. Tech.
ChEMBL_608993 (CHEMBL1073135)
EC50
3162.28±n/a nM
Citation
 Budzik, BWEvans, KAWisnoski, DDJin, JRivero, RASzewczyk, GRJayawickreme, CMoncol, DLYu, H Synthesis and structure-activity relationships of a series of 3-aryl-4-isoxazolecarboxamides as a new class of TGR5 agonists. Bioorg Med Chem Lett 20:1363-7 (2010)  
Target
Name:
G-protein coupled bile acid receptor 1
Synonyms:
BG37 GPBAR_HUMAN TGR5 hGPCR19
Type:
G Protein-Coupled Receptor (GPCR)
Mol. Mass.:
35260.02
Organism:
Homo sapiens (Human)
Description:
CHO cells transiently transfected with hTGR5.
Residue:
330
  
Inhibitor
Name:
BDBM50415427
Synonyms:
CHEMBL601218
Type:
Small organic molecule
Emp. Form.:
C19H14Cl2N2O2
Mol. Mass.:
373.233
SMILES:
Cc1onc(c1C(=O)N1CCc2cc(Cl)ccc12)-c1ccccc1Cl
: