Target
Neuropeptide Y receptor type 5
Ligand
BDBM50417039
Substrate
Meas. Tech.
ChEMBL_664979 (CHEMBL1259936)
Ki
0.158±n/a nM
Citation
 Leslie, CPBentley, JBiagetti, MContini, SDi Fabio, RDonati, DGenski, TGuery, SMazzali, AMerlo, GPizzi, DASacco, FSeri, CTessari, MZonzini, LCaberlotto, L Discovery and structure-activity relationship of a novel spirocarbamate series of NPY Y5 antagonists. Bioorg Med Chem Lett 20:6103-7 (2010)  
Target
Name:
Neuropeptide Y receptor type 5
Synonyms:
NPY-Y5 NPY5-R NPY5R_HUMAN NPYY5 Neuropeptide Y receptor type 5 ( NPY Y5) | Y5 receptor
Type:
Enzyme
Mol. Mass.:
50746.64
Organism:
Homo sapiens (Human)
Description:
Q15761
Residue:
445
  
Inhibitor
Name:
BDBM50417039
Synonyms:
CHEMBL1257761
Type:
Small organic molecule
Emp. Form.:
C23H28N4O3
Mol. Mass.:
408.4934
SMILES:
O=C1O[C@@]2(CN1c1ccccn1)CC[C@H](CNc1ccc(OC3CCC3)cn1)CC2
: