Target
Neuropeptide Y receptor type 5
Ligand
BDBM50417407
Substrate
Meas. Tech.
ChEMBL_686319 (CHEMBL1293075)
Ki
0.2±n/a nM
Citation
 Pizzi, DALeslie, CPMazzali, ASeri, CBiagetti, MBentley, JGenski, TDi Fabio, RContini, SSabbatini, FMZonzini, LCaberlotto, L Design, synthesis and SAR of a novel series of benzimidazoles as potent NPY Y5 antagonists. Bioorg Med Chem Lett 20:7120-3 (2010)  
Target
Name:
Neuropeptide Y receptor type 5
Synonyms:
NPY-Y5 NPY5-R NPY5R_HUMAN NPYY5 Neuropeptide Y receptor type 5 ( NPY Y5) | Y5 receptor
Type:
Enzyme
Mol. Mass.:
50746.64
Organism:
Homo sapiens (Human)
Description:
Q15761
Residue:
445
  
Inhibitor
Name:
BDBM50417407
Synonyms:
CHEMBL1289153
Type:
Small organic molecule
Emp. Form.:
C26H23FN4O2
Mol. Mass.:
442.4848
SMILES:
Fc1ccc(cc1)-c1ccc2[nH]c(nc2c1)N1CCC2(CN(C(=O)O2)c2ccccc2)CC1
: