Target
Metabotropic glutamate receptor 2
Ligand
BDBM50417839
Substrate
Meas. Tech.
ChEMBL_718092 (CHEMBL1671545)
EC50
794.33±n/a nM
Citation
 Trabanco, AADuvey, GCid, JMMacdonald, GJCluzeau, PNhem, VFurnari, RBehaj, NPoulain, GFinn, TLavreysen, HPoli, SRaux, AThollon, YPoirier, ND'Addona, DAndrés, JILutjens, RLe Poul, EImogai, HRocher, JP New positive allosteric modulators of the metabotropic glutamate receptor 2 (mGluR2): identification and synthesis of N-propyl-8-chloro-6-substituted isoquinolones. Bioorg Med Chem Lett 21:971-6 (2011)  
Target
Name:
Metabotropic glutamate receptor 2
Synonyms:
GPRC1B GRM2_HUMAN Metabotropic glutamate receptor mGlu2 | metabotropic glutamate 2
Type:
Enzyme
Mol. Mass.:
95584.88
Organism:
Homo sapiens (Human)
Description:
Q14416
Residue:
872
  
Inhibitor
Name:
BDBM50417839
Synonyms:
CHEMBL1669389
Type:
Small organic molecule
Emp. Form.:
C21H22ClN3O2
Mol. Mass.:
383.871
SMILES:
CCCn1ccc2cc(cc(Cl)c2c1=O)-c1ccc(nc1)N1CCOCC1
: