Target
5-hydroxytryptamine receptor 6
Ligand
BDBM50417934
Substrate
Meas. Tech.
ChEMBL_716899 (CHEMBL1670878)
Ki
0.186±n/a nM
Citation
 Ivachtchenko, AVGolovina, ESKadieva, MGKysil, VMMitkin, ODTkachenko, SEOkun, I Synthesis and SAR of 3-arylsulfonyl-pyrazolo[1,5-a]pyrimidines as potent serotonin 5-HT6 receptor antagonists. Bioorg Med Chem 19:1482-91 (2011)  
Target
Name:
5-hydroxytryptamine receptor 6
Synonyms:
5-HT-6 5-hydroxytryptamine receptor 6 (5-HT-6) 5-hydroxytryptamine receptor 6 (5HT6) HTR6 Serotonin 6 (5-HT6) receptor | Serotonin Receptor 6
Type:
G Protein-Coupled Receptor (GPCR)
Mol. Mass.:
46968.43
Organism:
Homo sapiens (Human)
Description:
P50406
Residue:
440
  
Inhibitor
Name:
BDBM50417934
Synonyms:
CHEMBL1668590 | US8829009, 1.1(7)
Type:
Small organic molecule
Emp. Form.:
C15H15ClN4O2S
Mol. Mass.:
350.823
SMILES:
CNc1nn2c(C)cc(C)nc2c1S(=O)(=O)c1cccc(Cl)c1
: