Target
Cytochrome P450 1A2
Ligand
BDBM50418082
Substrate
Meas. Tech.
ChEMBL_738454 (CHEMBL1743531)
Ki
13±n/a nM
Citation
 Fontana, EDansette, PMPoli, SM Cytochrome p450 enzymes mechanism based inhibitors: common sub-structures and reactivity. Curr Drug Metab 6:413-54 (2005)  
Target
Name:
Cytochrome P450 1A2
Synonyms:
CP1A2_HUMAN CYPIA2 Cytochrome P(3)450 Cytochrome P450 1A2 (CYP1A2) Cytochrome P450-P3
Type:
Enzyme
Mol. Mass.:
58423.38
Organism:
Homo sapiens (Human)
Description:
P05177
Residue:
516
  
Inhibitor
Name:
BDBM50418082
Synonyms:
CHEMBL1743360
Type:
Small organic molecule
Emp. Form.:
C15H12
Mol. Mass.:
192.2558
SMILES:
CC#Cc1ccc(cc1)-c1ccccc1
: