Target
Alpha-1D adrenergic receptor
Ligand
BDBM50006952
Substrate
Meas. Tech.
ChEMBL_753880 (CHEMBL1798142)
Ki
0.363±n/a nM
Citation
 Romeo, GMateria, LModica, MNPittalà, VSalerno, LSiracusa, MAManetti, FBotta, MMinneman, KP Novel 4-phenylpiperidine-2,6-dione derivatives. Ligands fora1-adrenoceptor subtypes. Eur J Med Chem 46:2676-90 (2011)  
Target
Name:
Alpha-1D adrenergic receptor
Synonyms:
ADA1D_HUMAN ADRA1D Adrenergic receptor alpha Alpha 1D-adrenoreceptor Alpha-1D adrenoceptor adrenergic Alpha1D
Type:
Enzyme Catalytic Domain
Mol. Mass.:
60485.82
Organism:
Homo sapiens (Human)
Description:
adrenergic Alpha1D ADRA1D HUMAN::P25100
Residue:
572
  
Inhibitor
Name:
BDBM50006952
Synonyms:
2-{2-[4-(2-Methoxy-phenyl)-piperazin-1-yl]-ethyl}-4,9-dihydro-2,4,9-triaza-fluorene-1,3-dione 3-{2-[4-(2-Methoxy-phenyl)-piperazin-1-yl]-ethyl}-1,5-dihydro-pyrimido[5,4-b]indole-2,4-dione | CHEMBL301707
Type:
Small organic molecule
Emp. Form.:
C23H25N5O3
Mol. Mass.:
419.4763
SMILES:
COc1ccccc1N1CCN(CCn2c(=O)[nH]c3c4ccccc4[nH]c3c2=O)CC1
: