Target
Melatonin receptor type 1A
Ligand
BDBM50419038
Substrate
Meas. Tech.
ChEMBL_762352 (CHEMBL1816423)
Ki
57.54±n/a nM
Citation
 Spadoni, GBedini, AOrlando, PLucarini, STarzia, GMor, MRivara, SLucini, VPannacci, MScaglione, F Bivalent ligand approach on N-{2-[(3-methoxyphenyl)methylamino]ethyl}acetamide: synthesis, binding affinity and intrinsic activity for MT(1) and MT(2) melatonin receptors. Bioorg Med Chem 19:4910-6 (2011)  
Target
Name:
Melatonin receptor type 1A
Synonyms:
MTNR1A MTR1A_HUMAN Mel1a melatonin receptor Melatonin receptor Melatonin receptor type 1 (MT1) | Melatonin receptor type 1A
Type:
Enzyme
Mol. Mass.:
39392.94
Organism:
Homo sapiens (Human)
Description:
P48039
Residue:
350
  
Inhibitor
Name:
BDBM50419038
Synonyms:
CHEMBL1813320
Type:
Small organic molecule
Emp. Form.:
C27H40N4O4
Mol. Mass.:
484.6309
SMILES:
CN(CCNC(C)=O)c1cccc(OCCCCCOc2cccc(c2)N(C)CCNC(C)=O)c1
: