Target
Histamine H4 receptor
Ligand
BDBM26226
Substrate
Meas. Tech.
ChEMBL_766548 (CHEMBL1827029)
Ki
79.43±n/a nM
Citation
 Verheij, MHde Graaf, Cde Kloe, GENijmeijer, SVischer, HFSmits, RAZuiderveld, OPHulscher, SSilvestri, LThompson, AJvan Muijlwijk-Koezen, JELummis, SCLeurs, Rde Esch, IJ Fragment library screening reveals remarkable similarities between the G protein-coupled receptor histamine H4 and the ion channel serotonin 5-HT3A. Bioorg Med Chem Lett 21:5460-4 (2011)  
Target
Name:
Histamine H4 receptor
Synonyms:
AXOR35 GPCR105 HH4R HRH4 Histamine H4 receptor Histamine receptor (H3 and H4) SP9144
Type:
G Protein-Coupled Receptor (GPCR)
Mol. Mass.:
44517.02
Organism:
Homo sapiens (Human)
Description:
Binding assays were using CHO cells stably expressing hH4R receptors.
Residue:
390
  
Inhibitor
Name:
BDBM26226
Synonyms:
(12S,17S)-6-(piperazin-1-yl)-11-oxa-3,5-diazatetracyclo[8.7.0.0^{2,7}.0^{12,17}]heptadeca-1(10),2(7),3,5-tetraen-4-amine | A-987306
Type:
Small organic molecule
Emp. Form.:
C18H25N5O
Mol. Mass.:
327.424
SMILES:
[H][C@]12CCCC[C@@]1([H])C1=C(CCc3c(nc(N)nc13)N1CCNCC1)O2
: