Target
Orexin/Hypocretin receptor type 1
Ligand
BDBM50417257
Substrate
Meas. Tech.
ChEMBL_768077 (CHEMBL1833033)
Ki
0.117±n/a nM
Citation
 Di Fabio, RPellacani, AFaedo, SRoth, APiccoli, LGerrard, PPorter, RAJohnson, CNThewlis, KDonati, DStasi, LSpada, SStemp, GNash, DBranch, CKindon, LMassagrande, MPoffe, ABraggio, SChiarparin, EMarchioro, CRatti, ECorsi, M Discovery process and pharmacological characterization of a novel dual orexin 1 and orexin 2 receptor antagonist useful for treatment of sleep disorders. Bioorg Med Chem Lett 21:5562-7 (2011)  
Target
Name:
Orexin/Hypocretin receptor type 1
Synonyms:
Hcrtr1 OX1R_RAT Orexin receptor type 1 (OX1R) Ox1-R | Ox1R
Type:
Protein
Mol. Mass.:
46817.55
Organism:
Rattus norvegicus (Rat)
Description:
P56718
Residue:
416
  
Inhibitor
Name:
BDBM50417257
Synonyms:
SB-649868
Type:
Small organic molecule
Emp. Form.:
C26H24FN3O3S
Mol. Mass.:
477.55
SMILES:
Cc1nc(C(=O)N2CCCC[C@H]2CNC(=O)c2cccc3occc23)c(s1)-c1ccc(F)cc1
: