Target
Orexin receptor type 2
Ligand
BDBM50419142
Substrate
Meas. Tech.
ChEMBL_768074 (CHEMBL1833030)
Ki
0.251±n/a nM
Citation
 Di Fabio, RPellacani, AFaedo, SRoth, APiccoli, LGerrard, PPorter, RAJohnson, CNThewlis, KDonati, DStasi, LSpada, SStemp, GNash, DBranch, CKindon, LMassagrande, MPoffe, ABraggio, SChiarparin, EMarchioro, CRatti, ECorsi, M Discovery process and pharmacological characterization of a novel dual orexin 1 and orexin 2 receptor antagonist useful for treatment of sleep disorders. Bioorg Med Chem Lett 21:5562-7 (2011)  
Target
Name:
Orexin receptor type 2
Synonyms:
HCRTR2 OX2R_HUMAN Orexin receptor type 2 (OR-2) Orexin receptor type 2 (OX2R) Ox-2-R | Ox2-R
Type:
Protein
Mol. Mass.:
50710.53
Organism:
Homo sapiens (Human)
Description:
O43614
Residue:
444
  
Inhibitor
Name:
BDBM50419142
Synonyms:
CHEMBL1830963
Type:
Small organic molecule
Emp. Form.:
C26H25FN2O2
Mol. Mass.:
416.4873
SMILES:
Fc1ccc(cc1)C(=O)NC[C@@H]1CCCCN1C(=O)c1ccccc1-c1ccccc1
: