Target
Alpha-2A adrenergic receptor
Ligand
BDBM50019848
Substrate
Meas. Tech.
ChEMBL_807929 (CHEMBL1959312)
Ki
7.1±n/a nM
Citation
 Mammoli, VBonifazi, ADel Bello, FDiamanti, EGiannella, MHudson, ALMattioli, LPerfumi, MPiergentili, AQuaglia, WTitomanlio, FPigini, M Favourable involvement ofa2A-adrenoreceptor antagonism in the I2-imidazoline binding sites-mediated morphine analgesia enhancement. Bioorg Med Chem 20:2259-65 (2012)  
Target
Name:
Alpha-2A adrenergic receptor
Synonyms:
ADA2A_HUMAN ADRA2R Adrenergic alpha2A Alpha-2 adrenergic receptor subtype C10 Alpha-2A adrenoreceptor alpha-2A adrenergic receptor [Homo sapiens]
Type:
Enzyme
Mol. Mass.:
48979.91
Organism:
Homo sapiens (Human)
Description:
P08913
Residue:
450
  
Inhibitor
Name:
BDBM50019848
Synonyms:
2-(2,3-dihydro-1,4-benzodioxin-2-yl)-4,5-dihydro-1H-imidazole CHEMBL10316 US8633208, Idazoxan
Type:
Small organic molecule
Emp. Form.:
C11H12N2O2
Mol. Mass.:
204.2252
SMILES:
C1CN=C(N1)C1COc2ccccc2O1
: