Target
ATP-dependent translocase ABCB1
Ligand
BDBM20192
Substrate
Meas. Tech.
ChEMBL_836873 (CHEMBL2075511)
IC50
8200±n/a nM
Citation
 Wang, ECasciano, CNClement, RPJohnson, WW Cholesterol interaction with the daunorubicin binding site of P-glycoprotein. Biochem Biophys Res Commun 276:909-16 (2000)  
Target
Name:
ATP-dependent translocase ABCB1
Synonyms:
ABCB1 MDR1_HUMAN Multidrug resistance protein 1 P-glycoprotein (P-gp) PGY1
Type:
Protein
Mol. Mass.:
141503.50
Organism:
Homo sapiens (Human)
Description:
P08183
Residue:
1280
  
Inhibitor
Name:
BDBM20192
Synonyms:
(1S,2R,5S,10S,11S,14R,15R)-2,15-dimethyl-14-[(2R)-6-methylheptan-2-yl]tetracyclo[8.7.0.0^{2,7}.0^{11,15}]heptadec-7-en-5-ol | cholesterol
Type:
Steroid
Emp. Form.:
C27H46O
Mol. Mass.:
386.6535
SMILES:
[H][C@@]1(CC[C@@]2([H])[C@]3([H])CC=C4C[C@@H](O)CC[C@]4(C)[C@@]3([H])CC[C@]12C)[C@H](C)CCCC(C)C
: