Target
Solute carrier family 22 member 3
Ligand
BDBM39687
Substrate
Meas. Tech.
ChEMBL_839283 (CHEMBL2077954)
IC50
90±n/a nM
Citation
 Hayer-Zillgen, MBrüss, MBönisch, H Expression and pharmacological profile of the human organic cation transporters hOCT1, hOCT2 and hOCT3. Br J Pharmacol 136:829-36 (2002)  
Target
Name:
Solute carrier family 22 member 3
Synonyms:
EMT Extraneuronal monoamine transporter Organic cation transporter 3 SLC22A3
Type:
PROTEIN
Mol. Mass.:
61292.57
Organism:
Homo sapiens (Human)
Description:
ChEMBL_934315
Residue:
556
  
Inhibitor
Name:
BDBM39687
Synonyms:
(2E)-1-ethyl-2-[(1-ethyl-2-quinolin-1-iumyl)methylidene]quinoline;chloride (2E)-1-ethyl-2-[(1-ethylquinolin-1-ium-2-yl)methylidene]quinoline;chloride CHEMBL1197556 SMR000137574 | cid_5717105
Type:
Small organic molecule
Emp. Form.:
C23H23N2
Mol. Mass.:
327.4416
SMILES:
CCN1\C(=C\c2ccc3ccccc3[n+]2CC)C=Cc2ccccc12
: