Target
Solute carrier family 15 member 1
Ligand
BDBM50350464
Substrate
Meas. Tech.
ChEMBL_838254 (CHEMBL2076202)
Ki
>10000000±n/a nM
Citation
 Luckner, PBrandsch, M Interaction of 31 beta-lactam antibiotics with the H+/peptide symporter PEPT2: analysis of affinity constants and comparison with PEPT1. Eur J Pharm Biopharm 59:17-24 (2004)  
Target
Name:
Solute carrier family 15 member 1
Synonyms:
Intestinal H(+)/peptide cotransporter Oligopeptide transporter, small intestine isoform Peptide transporter 1 SLC15A1
Type:
PROTEIN
Mol. Mass.:
78818.07
Organism:
Homo sapiens (Human)
Description:
ChEMBL_1488839
Residue:
708
  
Inhibitor
Name:
BDBM50350464
Synonyms:
AMOXICILLINE Amoxi-Tabs | Amoxicillin
Type:
Small organic molecule
Emp. Form.:
C16H19N3O5S
Mol. Mass.:
365.404
SMILES:
CC1(C)S[C@@H]2[C@H](NC(=O)[C@H](N)c3ccc(O)cc3)C(=O)N2[C@H]1C(O)=O
: