Target
Solute carrier family 15 member 2
Ligand
BDBM50350483
Substrate
Meas. Tech.
ChEMBL_838253 (CHEMBL2076201)
Ki
3300000±n/a nM
Citation
 Luckner, PBrandsch, M Interaction of 31 beta-lactam antibiotics with the H+/peptide symporter PEPT2: analysis of affinity constants and comparison with PEPT1. Eur J Pharm Biopharm 59:17-24 (2004)  
Target
Name:
Solute carrier family 15 member 2
Synonyms:
Oligopeptide transporter, kidney isoform S15A2_RAT | Slc15a2
Type:
PROTEIN
Mol. Mass.:
81331.63
Organism:
Rattus norvegicus
Description:
ChEMBL_838253
Residue:
729
  
Inhibitor
Name:
BDBM50350483
Synonyms:
Bactocill | OXACILLIN
Type:
Small organic molecule
Emp. Form.:
C19H19N3O5S
Mol. Mass.:
401.436
SMILES:
Cc1onc(c1C(=O)N[C@H]1[C@H]2SC(C)(C)[C@@H](N2C1=O)C(O)=O)-c1ccccc1
: