Target
Solute carrier family 15 member 1
Ligand
BDBM50420259
Substrate
Meas. Tech.
ChEMBL_838254 (CHEMBL2076202)
Ki
>10000000±n/a nM
Citation
 Luckner, PBrandsch, M Interaction of 31 beta-lactam antibiotics with the H+/peptide symporter PEPT2: analysis of affinity constants and comparison with PEPT1. Eur J Pharm Biopharm 59:17-24 (2004)  
Target
Name:
Solute carrier family 15 member 1
Synonyms:
Intestinal H(+)/peptide cotransporter Oligopeptide transporter, small intestine isoform Peptide transporter 1 SLC15A1
Type:
PROTEIN
Mol. Mass.:
78818.07
Organism:
Homo sapiens (Human)
Description:
ChEMBL_1488839
Residue:
708
  
Inhibitor
Name:
BDBM50420259
Synonyms:
CEFTAZIDIME
Type:
Small organic molecule
Emp. Form.:
C22H22N6O7S2
Mol. Mass.:
546.576
SMILES:
CC(C)(O\N=C(/C(=O)N[C@H]1[C@H]2SCC(C[n+]3ccccc3)=C(N2C1=O)C([O-])=O)c1csc(N)n1)C(O)=O
: