Target
5-hydroxytryptamine receptor 4
Ligand
BDBM82505
Substrate
Meas. Tech.
ChEMBL_3289 (CHEMBL619089)
IC50
0.08±n/a nM
Citation
 Gaster, LMJoiner, GFKing, FDWyman, PASutton, JMBingham, SEllis, ESSanger, GJWardle, KA N-[(1-butyl-4-piperidinyl)methyl]-3,4dihydro-2H-[1,3]oxazino[3,2- a]indole10-carboxamide hydrochloride: the first potent and selective 5-HT4 receptor antagonist amide with oral activity. J Med Chem 38:4760-3 (1996)  
Target
Name:
5-hydroxytryptamine receptor 4
Synonyms:
5-HT4 5HT4R_CAVPO Serotonin 4 (5-HT4) receptor
Type:
Enzyme Catalytic Domain
Mol. Mass.:
43735.29
Organism:
GUINEA PIG
Description:
5-HT4 HTR4 GUINEA PIG::O70528
Residue:
388
  
Inhibitor
Name:
BDBM82505
Synonyms:
CAS_121881 SB204070
Type:
Small organic molecule
Emp. Form.:
C19H27ClN2O4
Mol. Mass.:
382.882
SMILES:
CCCCN1CCC(COC(=O)c2cc(Cl)c(N)c3OCCOc23)CC1
: