Target
Sex hormone-binding globulin
Ligand
BDBM50423540
Substrate
Meas. Tech.
ChEMBL_466706 (CHEMBL922711)
Kd
21±n/a nM
Citation
 Cherkasov, ABan, FSantos-Filho, OThorsteinson, NFallahi, MHammond, GL An updated steroid benchmark set and its application in the discovery of novel nanomolar ligands of sex hormone-binding globulin. J Med Chem 51:2047-56 (2008)  
Target
Name:
Sex hormone-binding globulin
Synonyms:
SHBG Testis-specific androgen-binding protein
Type:
PROTEIN
Mol. Mass.:
43780.19
Organism:
Homo sapiens (Human)
Description:
ChEMBL_466706
Residue:
402
  
Inhibitor
Name:
BDBM50423540
Synonyms:
CHEMBL259635
Type:
Small organic molecule
Emp. Form.:
C23H32O2
Mol. Mass.:
340.499
SMILES:
CC[C@]12CC(=C)C3[C@@H](CCC4=C[C@H](O)CC[C@]34C)[C@@H]1CC[C@@]2(O)C#C
: