Target
Prostaglandin E2 receptor EP1 subtype
Ligand
BDBM50423568
Substrate
Meas. Tech.
ChEMBL_468124 (CHEMBL934144)
IC50
158±n/a nM
Citation
 Hall, ABit, RABrown, SHChowdhury, AGiblin, GMHurst, DNKilford, IRLewell, XNaylor, AScoccitti, T Novel methylene-linked heterocyclic EP1 receptor antagonists. Bioorg Med Chem Lett 18:1592-7 (2008)  
Target
Name:
Prostaglandin E2 receptor EP1 subtype
Synonyms:
PE2R1_HUMAN PTGER1 Prostaglandin E2 receptor EP1 subtype Prostanoid EP1 receptor
Type:
Enzyme
Mol. Mass.:
41834.57
Organism:
Homo sapiens (Human)
Description:
P34995
Residue:
402
  
Inhibitor
Name:
BDBM50423568
Synonyms:
CHEMBL403459
Type:
Small organic molecule
Emp. Form.:
C20H18ClNO3
Mol. Mass.:
355.815
SMILES:
Cc1cc(cn1Cc1cc(Cl)ccc1OCc1ccccc1)C(O)=O
: