Target
Carbonic anhydrase 2
Ligand
BDBM26983
Substrate
Meas. Tech.
ChEMBL_937287 (CHEMBL2319050)
Ki
1600000±n/a nM
Citation
 Nishimori, IVullo, DMinakuchi, TScozzafava, ACapasso, CSupuran, CT Restoring catalytic activity to the human carbonic anhydrase (CA) related proteins VIII, X and XI affords isoforms with high catalytic efficiency and susceptibility to anion inhibition. Bioorg Med Chem Lett 23:256-60 (2012)  
Target
Name:
Carbonic anhydrase 2
Synonyms:
CA-II CAC Carbonate dehydratase II Carbonic anhydrase 2 (CA-II) Carbonic anhydrase C Carbonic anhydrase II (CA-II) Carbonic anhydrase II (hCA II) | Carbonic anhydrase isoenzyme II (hCA II)
Type:
Enzyme
Mol. Mass.:
29250.71
Organism:
Homo sapiens (Human)
Description:
P00918
Residue:
260
  
Inhibitor
Name:
BDBM26983
Synonyms:
CHEMBL1644028 Thiocyanate sodium thiocyanate
Type:
Ion
Emp. Form.:
CNS
Mol. Mass.:
58.083
SMILES:
[N-]=C=S
: