Target
Multidrug and toxin extrusion protein 2
Ligand
BDBM50216627
Substrate
Meas. Tech.
ChEMBL_934318 (CHEMBL2320304)
IC50
288000±n/a nM
Citation
 Wittwer, MBZur, AAKhuri, NKido, YKosaka, AZhang, XMorrissey, KMSali, AHuang, YGiacomini, KM Discovery of potent, selective multidrug and toxin extrusion transporter 1 (MATE1, SLC47A1) inhibitors through prescription drug profiling and computational modeling. J Med Chem 56:781-95 (2013)  
Target
Name:
Multidrug and toxin extrusion protein 2
Synonyms:
Kidney-specific H(+)/organic cation antiporter MATE2 SLC47A2 hMATE-2
Type:
PROTEIN
Mol. Mass.:
65098.38
Organism:
Homo sapiens (Human)
Description:
ChEMBL_934314
Residue:
602
  
Inhibitor
Name:
BDBM50216627
Synonyms:
(alpha-methyl-1-adamantyl)methylamine CHEMBL959 US11241393, Rimantadine rimantidin
Type:
Small organic molecule
Emp. Form.:
C12H21N
Mol. Mass.:
179.3018
SMILES:
CC(N)C12CC3CC(CC(C3)C1)C2
: