Target
Substance-P receptor
Ligand
BDBM50425522
Substrate
Meas. Tech.
ChEMBL_936062 (CHEMBL2319304)
Ki
1.000000±n/a nM
Citation
 Bornot, ABauer, UBrown, AFirth, MHellawell, CEngkvist, O Systematic exploration of dual-acting modulators from a combined medicinal chemistry and biology perspective. J Med Chem 56:1197-210 (2013)  
Target
Name:
Substance-P receptor
Synonyms:
NK-1 receptor NK1 Receptor NK1R_HUMAN Neurokinin-1 (NK-1) SPR TACR1 Tachykinin receptor 1 (NK1) | tachykinin
Type:
G Protein-Coupled Receptor (GPCR)
Mol. Mass.:
46254.43
Organism:
Homo sapiens (Human)
Description:
P25103
Residue:
407
  
Inhibitor
Name:
BDBM50425522
Synonyms:
CHEMBL2313630
Type:
Small organic molecule
Emp. Form.:
C26H30Cl2N4O3
Mol. Mass.:
517.447
SMILES:
CCOC(=O)N(C1CCN(CCn2c3ccccc3n(C(C)=C)c2=O)CC1)c1ccc(Cl)c(Cl)c1
: