Target
Neuropeptides B/W receptor type 1
Ligand
BDBM50425577
Substrate
Meas. Tech.
ChEMBL_936637 (CHEMBL2319036)
IC50
430±n/a nM
Citation
 Guerrero, MUrbano, MSchaeffer, MTBrown, SRosen, HRoberts, E SAR analysis of novel non-peptidic NPBWR1 (GPR7) antagonists. Bioorg Med Chem Lett 23:614-9 (2013)  
Target
Name:
Neuropeptides B/W receptor type 1
Synonyms:
GPR7 NPBWR1 | neuropeptides B/W receptor 1
Type:
Enzyme Catalytic Domain
Mol. Mass.:
36111.82
Organism:
Homo sapiens (Human)
Description:
gi_119607128
Residue:
328
  
Inhibitor
Name:
BDBM50425577
Synonyms:
CHEMBL2000954
Type:
Small organic molecule
Emp. Form.:
C22H17ClN2O2S
Mol. Mass.:
408.901
SMILES:
CSc1ccc(Oc2c(Cl)cnn(Cc3cccc4ccccc34)c2=O)cc1
: