Target
Melatonin receptor type 1B
Ligand
BDBM50426656
Substrate
Meas. Tech.
ChEMBL_939499 (CHEMBL2328004)
EC50
0.110000±n/a nM
Citation
 Hu, YZhu, JChan, KHWong, YH Development of substituted N-[3-(3-methoxylphenyl)propyl] amides as MT(2)-selective melatonin agonists: improving metabolic stability. Bioorg Med Chem 21:547-52 (2012)  
Target
Name:
Melatonin receptor type 1B
Synonyms:
MTNR1B Mel-1B-R Melatonin 1B Melatonin receptor type 1B | Melatonin receptor type 2 (MT2)
Type:
Enzyme
Mol. Mass.:
40203.54
Organism:
Homo sapiens (Human)
Description:
P49286
Residue:
362
  
Inhibitor
Name:
BDBM50426656
Synonyms:
CHEMBL2326200
Type:
Small organic molecule
Emp. Form.:
C22H25NO3
Mol. Mass.:
351.4388
SMILES:
CCC(=O)NCCCc1cc(OC)ccc1C#Cc1cccc(OC)c1
: