Target
Nuclear factor NF-kappa-B p105 subunit
Ligand
BDBM50427514
Substrate
Meas. Tech.
ChEMBL_941587 (CHEMBL2330627)
EC50
700000±n/a nM
Citation
 Marzaro, GGuiotto, ABorgatti, MFinotti, AGambari, RBreveglieri, GChilin, A Psoralen derivatives as inhibitors of NF-¿B/DNA interaction: synthesis, molecular modeling, 3D-QSAR, and biological evaluation. J Med Chem 56:1830-42 (2013)  
Target
Name:
Nuclear factor NF-kappa-B p105 subunit
Synonyms:
NFKB1 Nuclear factor NF-kappa-B (NF-kB) Nuclear factor NF-kappa-B p105 subunit
Type:
Protein
Mol. Mass.:
105329.57
Organism:
Homo sapiens (Human)
Description:
P19838
Residue:
968
  
Inhibitor
Name:
BDBM50427514
Synonyms:
CHEMBL2322249
Type:
Small organic molecule
Emp. Form.:
C27H26N2O5
Mol. Mass.:
458.5057
SMILES:
Cc1c(CCC(=O)Nc2ccc(cc2)C(N)=O)c(=O)oc2c(C)c3oc4CCCCc4c3cc12
: