Target
Nuclear factor NF-kappa-B p105 subunit
Ligand
BDBM50427527
Substrate
Meas. Tech.
ChEMBL_941587 (CHEMBL2330627)
EC50
80000±n/a nM
Citation
 Marzaro, GGuiotto, ABorgatti, MFinotti, AGambari, RBreveglieri, GChilin, A Psoralen derivatives as inhibitors of NF-¿B/DNA interaction: synthesis, molecular modeling, 3D-QSAR, and biological evaluation. J Med Chem 56:1830-42 (2013)  
Target
Name:
Nuclear factor NF-kappa-B p105 subunit
Synonyms:
NFKB1 Nuclear factor NF-kappa-B (NF-kB) Nuclear factor NF-kappa-B p105 subunit
Type:
Protein
Mol. Mass.:
105329.57
Organism:
Homo sapiens (Human)
Description:
P19838
Residue:
968
  
Inhibitor
Name:
BDBM50427527
Synonyms:
CHEMBL2322255
Type:
Small organic molecule
Emp. Form.:
C25H23NO6
Mol. Mass.:
433.4532
SMILES:
Cc1oc2c(C)c3oc(=O)c(CCC(=O)Nc4cccc(c4)C(O)=O)c(C)c3cc2c1C
: