Target
Melanocyte-stimulating hormone receptor
Ligand
BDBM50427692
Substrate
Meas. Tech.
ChEMBL_941843 (CHEMBL2329876)
EC50
1.9±n/a nM
Citation
 Singh, ADirain, MWitek, RRocca, JREdison, ASHaskell-Luevano, C Structure-activity relationships of peptides incorporating a bioactive reverse-turn heterocycle at the melanocortin receptors: identification of a 5800-fold mouse melanocortin-3 receptor (mMC3R) selective antagonist/partial agonist versus the mouse melanocortin-4 receptor (mMC4R). J Med Chem 56:2747-63 (2013)  
Target
Name:
Melanocyte-stimulating hormone receptor
Synonyms:
MC1-R Mc1r Melanocyte-stimulating hormone receptor | Msh-r
Type:
PROTEIN
Mol. Mass.:
35238.60
Organism:
Mus musculus
Description:
ChEMBL_1498846
Residue:
315
  
Inhibitor
Name:
BDBM50427692
Synonyms:
CHEMBL2323789
Type:
Small organic molecule
Emp. Form.:
C80H96N18O15S3
Mol. Mass.:
1645.925
SMILES:
C[C@@H]1NC(=O)[C@H](CC(N)=O)NC(=O)[C@H](Cc2c[nH]c3ccccc23)N2C[C@H](CCCN=C(N)N)NC(=O)[C@@H](CSCC2=O)NC(=O)[C@@H](Cc2ccccc2)NC(=O)[C@H](Cc2ccccc2)NC(=O)[C@H](CSSC[C@H](NC(=O)[C@H](Cc2ccccc2)NC1=O)C(=O)N[C@@H](Cc1ccc(O)cc1)C(N)=O)NC(=O)[C@@H](N)Cc1ccc(O)cc1
: