Target
Melanocortin receptor 5
Ligand
BDBM50339348
Substrate
Meas. Tech.
ChEMBL_941840 (CHEMBL2329831)
EC50
1.5±n/a nM
Citation
 Singh, ADirain, MWitek, RRocca, JREdison, ASHaskell-Luevano, C Structure-activity relationships of peptides incorporating a bioactive reverse-turn heterocycle at the melanocortin receptors: identification of a 5800-fold mouse melanocortin-3 receptor (mMC3R) selective antagonist/partial agonist versus the mouse melanocortin-4 receptor (mMC4R). J Med Chem 56:2747-63 (2013)  
Target
Name:
Melanocortin receptor 5
Synonyms:
MC5R_MOUSE Melanocortin receptor 5 | Melanocortin receptor 5 (MC5R)
Type:
Enzyme
Mol. Mass.:
36966.58
Organism:
Mus musculus (Mouse)
Description:
P41149
Residue:
325
  
Inhibitor
Name:
BDBM50339348
Synonyms:
(4R,7S,10S,13S,16S,19S,22R,25S,28R)-25-((1H-imidazol-4-yl)methyl)-16-((1H-indol-3-yl)methyl)-13-(2-amino-2-oxoethyl)-N-((S)-1-amino-3-(4-hydroxyphenyl)-1-oxopropan-2-yl)-28-((S)-2-amino-3-(4-hydroxyphenyl)propanamido)-7,22-dibenzyl-19-(3-guanidinopropyl)-10-methyl-6,9,12,15,18,21,24,27-octaoxo-1,2-dithia-5,8,11,14,17,20,23,26-octaazacyclononacosane-4-carboxamide | CHEMBL1688107
Type:
Small organic molecule
Emp. Form.:
C72H87N19O14S2
Mol. Mass.:
1506.71
SMILES:
C[C@@H]1NC(=O)[C@H](CC(N)=O)NC(=O)[C@H](Cc2c[nH]c3ccccc23)NC(=O)[C@H](CCCN=C(N)N)NC(=O)[C@@H](Cc2ccccc2)NC(=O)[C@H](Cc2cnc[nH]2)NC(=O)[C@H](CSSC[C@H](NC(=O)[C@H](Cc2ccccc2)NC1=O)C(=O)N[C@@H](Cc1ccc(O)cc1)C(N)=O)NC(=O)[C@@H](N)Cc1ccc(O)cc1
: