Target
Melanocortin receptor 5
Ligand
BDBM50427685
Substrate
Meas. Tech.
ChEMBL_941840 (CHEMBL2329831)
EC50
460±n/a nM
Citation
 Singh, ADirain, MWitek, RRocca, JREdison, ASHaskell-Luevano, C Structure-activity relationships of peptides incorporating a bioactive reverse-turn heterocycle at the melanocortin receptors: identification of a 5800-fold mouse melanocortin-3 receptor (mMC3R) selective antagonist/partial agonist versus the mouse melanocortin-4 receptor (mMC4R). J Med Chem 56:2747-63 (2013)  
Target
Name:
Melanocortin receptor 5
Synonyms:
MC5R_MOUSE Melanocortin receptor 5 | Melanocortin receptor 5 (MC5R)
Type:
Enzyme
Mol. Mass.:
36966.58
Organism:
Mus musculus (Mouse)
Description:
P41149
Residue:
325
  
Inhibitor
Name:
BDBM50427685
Synonyms:
CHEMBL2323798
Type:
Small organic molecule
Emp. Form.:
C77H94N18O15S3
Mol. Mass.:
1607.877
SMILES:
C[C@@H]1NC(=O)[C@H](CC(N)=O)NC(=O)[C@H](Cc2c[nH]c3ccccc23)N2C[C@H](CCCCN)NC(=O)[C@@H](CSCC2=O)NC(=O)[C@@H](Cc2ccccc2)NC(=O)[C@H](Cc2cnc[nH]2)NC(=O)[C@H](CSSC[C@H](NC(=O)[C@H](Cc2ccccc2)NC1=O)C(=O)N[C@@H](Cc1ccc(O)cc1)C(N)=O)NC(=O)[C@@H](N)Cc1ccc(O)cc1
: