Target
Botulinum neurotoxin type A
Ligand
BDBM50001839
Substrate
Meas. Tech.
ChEMBL_941189 (CHEMBL2329700)
IC50
5200±n/a nM
Citation
 Dadgar, SRamjan, ZFloriano, WB Paclitaxel is an inhibitor and its boron dipyrromethene derivative is a fluorescent recognition agent for botulinum neurotoxin subtype A. J Med Chem 56:2791-803 (2013)  
Target
Name:
Botulinum neurotoxin type A
Synonyms:
BXA1_CLOBO bonT | botA
Type:
PROTEIN
Mol. Mass.:
149450.01
Organism:
Clostridium botulinum
Description:
ChEMBL_1510137
Residue:
1296
  
Inhibitor
Name:
BDBM50001839
Synonyms:
CHEMBL428647 taxol
Type:
Small organic molecule
Emp. Form.:
C47H51NO14
Mol. Mass.:
853.9061
SMILES:
CC(=O)O[C@@H]1C2=C(C)[C@H](C[C@@](O)([C@@H](OC(=O)c3ccccc3)[C@@H]3[C@@]4(CO[C@@H]4C[C@H](O)[C@@]3(C)C1=O)OC(C)=O)C2(C)C)OC(=O)[C@H](O)[C@@H](NC(=O)c1ccccc1)c1ccccc1
: